{"text_format":"1","workbook":"xlsx","n_sheets":7,"sheets":["Instruções","1.Input","2.Resultado","3.Fluxo_Caixa","Dados","Textos_Ajuda","aux"],"not_rendered":{"charts":2,"images":19,"macros":1,"external_links":0,"defined_names":60,"comments":0,"pivot_tables":0},"unopened":[],"bounds":{"document_bytes":16777216,"sheet_cells":100000,"rows_first":2000,"rows_last":500,"rows_between":2000,"halvings":0,"cell_chars":16384,"cell_head_chars":4096},"cells_cut":0,"cells_raw":0,"read":"whole","date_system":"1900"}

{"sheet":"Instruções","index":0,"n_rows":7,"n_cols":3,"rows_kept":7,"cut":false,"hidden":false,"merged":[]}
[]
[]
[]
[null,"Instruções para utilização da Planilha","Instruções para utilização da Planilha"]
[]
[null,"1º","Insira as informações na aba \"1.Input \" e obtenha o resultado do estudo na aba \"2.Resultado\""]
[null,"2º","Habilite as macros para permitir a execução das funcionalidades da planilha"]

{"sheet":"1.Input","index":1,"n_rows":48,"n_cols":13,"rows_kept":48,"cut":false,"hidden":false,"merged":[[4,1,4,5],[1,7,1,8],[2,7,2,8],[1,9,2,9],[47,7,47,13],[30,7,30,13],[25,8,29,12],[34,8,37,12],[38,7,38,13],[42,8,46,12]]}
[]
[null,null,null,"Custo Frota Própria",null,null,null,{"$f":"'2.Resultado'!$G$15","v":24832},null,{"$f":"\"Saving: \"&\nTEXT((H3/H2-1)*-1,\"0%\")","v":"Saving: -18%"}]
[null,null,null,"Custo Frota Locada",null,null,null,{"$f":"'2.Resultado'!$G$22","v":29224.799999999999}]
[]
[null,"Os campos com fundo \"Amarelo\" podem ser alterados de acordo com os dados da empresa"]
[]
[null,null,"VALORES FROTA LOCADA"]
[]
[null,null,"VALOR DA PROPOSTA DE LOCAÇÃO"]
[]
[null,null,"Valor mensal do aluguel ",1230]
[]
[]
[null,null,"VALORES FROTA PRÓPRIA"]
[]
[null,1,"VALOR DE COMPRA DO VEÍCULO (AQUISIÇÃO)"]
[]
[null,null,"1.1 Valor de mercado do veículo",40340]
[null,null,"1.2 % desconto na compra",0.12]
[null,null,"1.3 Valor da compra com desconto",{"$f":"D18*(1-D19)","v":35499.199999999997}]
[null,null,"1.4 Frete entrega do veículo",150]
[]
[]
[null,2,"CUSTOS PARA MANTER O VEÍCULO (CUSTO FROTA) [VALOR ANUAL]",null,null,null,null,null,null,"Ano 1","Ano 2","Ano 3","Total"]
[null,null,null,null,null,null,null,null,null,{"$f":"IFERROR(INDEX(TBL_TEXTOS_AJUDA[],CP_SELECAO_ITEM,MATCH(J24,TBL_TEXTOS_AJUDA[#Headers],0)),\"\")","v":1419.9679999999998},{"$f":"IFERROR(INDEX(TBL_TEXTOS_AJUDA[],CP_SELECAO_ITEM,MATCH(K24,TBL_TEXTOS_AJUDA[#Headers],0)),\"\")","v":1313.9786666666666},{"$f":"IFERROR(INDEX(TBL_TEXTOS_AJUDA[],CP_SELECAO_ITEM,MATCH(L24,TBL_TEXTOS_AJUDA[#Headers],0)),\"\")","v":1207.9893333333334},{"$f":"SUM(J25:L25)","v":3941.9360000000001}]
[null,1,"2.1 Contratação de Seguro  [ % sobre o Valor de Compra ] - Anual",0.04,null,null,null,null,{"$f":"IFERROR(INDEX(TBL_TEXTOS_AJUDA[],CP_SELECAO_ITEM,MATCH(\"Texto Ajuda\",TBL_TEXTOS_AJUDA[#Headers],0)),\"\")","v":"Custo de apólices de seguro que protegem o carro, passageiros e terceiros. A média de Seguro pode chegar até 7% do valor do veículo, sem contar a Franquia. Porém, para o presente estudo estamos considerando 4%, visto que as Seguradoras concedem descontos para empresas. Conforme cálculo acima, o valor do seguro apresenta uma redução anual em função da desvalorização do veículo."}]
[null,2,"2.2 IPVA + Licenciamento  [ % sobre o Valor de Compra ] - Anual",4.4999999999999998E-2]
[null,3,"2.3 Manutenção Preventiva e Corretiva -  Anual",645.98400000000004]
[null,4,"2.4 Custo administrativo com a gestão da frota por Veículo - Anual",1800]
[null,5,"2.5 Frota reserva  - Anual",484.08000000000004]
[null,null,null,null,null,null,null,{"$f":"IFERROR(HYPERLINK(IFERROR(INDEX(TBL_TEXTOS_AJUDA[],CP_SELECAO_ITEM,MATCH(\"Link\",TBL_TEXTOS_AJUDA[#Headers],0)),\"\"),IFERROR(INDEX(TBL_TEXTOS_AJUDA[],CP_SELECAO_ITEM,MATCH(\"Link_Amigavel\",TBL_TEXTOS_AJUDA[#Headers],0)),\"\")),\"\")","v":"Veja o comparativo de Seguro da Quadro Rodas"}]
[]
[null,3,"DESPESAS COM A VENDA DO VEÍCULO",null,null,null,null,null,null,"Ano 1","Ano 2","Ano 3","Ano 4"]
[null,null,null,null,null,null,null,null,null,{"$f":"IFERROR(INDEX(TBL_TEXTOS_AJUDA[],CP_SELECAO_ITEM,MATCH(J33,TBL_TEXTOS_AJUDA[#Headers],0)),\"\")","v":1419.9679999999998},{"$f":"IFERROR(INDEX(TBL_TEXTOS_AJUDA[],CP_SELECAO_ITEM,MATCH(K33,TBL_TEXTOS_AJUDA[#Headers],0)),\"\")","v":1313.9786666666666},{"$f":"IFERROR(INDEX(TBL_TEXTOS_AJUDA[],CP_SELECAO_ITEM,MATCH(L33,TBL_TEXTOS_AJUDA[#Headers],0)),\"\")","v":1207.9893333333334},{"$f":"IFERROR(INDEX(TBL_TEXTOS_AJUDA[],CP_SELECAO_ITEM,MATCH(M33,TBL_TEXTOS_AJUDA[#Headers],0)),\"\")","v":0}]
[null,6,"3.1 Valor Estimado para a venda do veículo",27550,null,null,null,null,{"$f":"IFERROR(INDEX(TBL_TEXTOS_AJUDA[],CP_SELECAO_ITEM,MATCH(\"Texto Ajuda\",TBL_TEXTOS_AJUDA[#Headers],0)),\"\")","v":"Custo de apólices de seguro que protegem o carro, passageiros e terceiros. A média de Seguro pode chegar até 7% do valor do veículo, sem contar a Franquia. Porém, para o presente estudo estamos considerando 4%, visto que as Seguradoras concedem descontos para empresas. Conforme cálculo acima, o valor do seguro apresenta uma redução anual em função da desvalorização do veículo."}]
[null,7,"3.2 Custos do processo de venda",350]
[null,8,"3.3 Manutenção para venda",710]
[null,9,"3.4 Frete desmobilização do veículo",350]
[null,null,null,null,null,null,null,{"$f":"IFERROR(HYPERLINK(IFERROR(INDEX(TBL_TEXTOS_AJUDA[],CP_SELECAO_ITEM,MATCH(\"Link\",TBL_TEXTOS_AJUDA[#Headers],0)),\"\"),IFERROR(INDEX(TBL_TEXTOS_AJUDA[],CP_SELECAO_ITEM,MATCH(\"Link_Amigavel\",TBL_TEXTOS_AJUDA[#Headers],0)),\"\")),\"\")","v":"Veja o comparativo de Seguro da Quadro Rodas"}]
[]
[null,4,"VALORES ECONÔMICOS/FINANCEIROS/FISCAIS",null,null,null,null,null,null,"Ano 1","Ano 2","Ano 3","Total"]
[null,null,null,null,null,null,null,null,null,{"$f":"IFERROR(INDEX(TBL_TEXTOS_AJUDA[],CP_SELECAO_ITEM,MATCH(J41,TBL_TEXTOS_AJUDA[#Headers],0)),\"\")","v":1419.9679999999998},{"$f":"IFERROR(INDEX(TBL_TEXTOS_AJUDA[],CP_SELECAO_ITEM,MATCH(K41,TBL_TEXTOS_AJUDA[#Headers],0)),\"\")","v":1313.9786666666666},{"$f":"IFERROR(INDEX(TBL_TEXTOS_AJUDA[],CP_SELECAO_ITEM,MATCH(L41,TBL_TEXTOS_AJUDA[#Headers],0)),\"\")","v":1207.9893333333334},{"$f":"SUM(J42:L42)","v":3941.9360000000001}]
[null,10,"4.1 Imposto de Renda + Contribuição Social - Anual",0.34,null,null,null,null,{"$f":"IFERROR(INDEX(TBL_TEXTOS_AJUDA[],CP_SELECAO_ITEM,MATCH(\"Texto Ajuda\",TBL_TEXTOS_AJUDA[#Headers],0)),\"\")","v":"Custo de apólices de seguro que protegem o carro, passageiros e terceiros. A média de Seguro pode chegar até 7% do valor do veículo, sem contar a Franquia. Porém, para o presente estudo estamos considerando 4%, visto que as Seguradoras concedem descontos para empresas. Conforme cálculo acima, o valor do seguro apresenta uma redução anual em função da desvalorização do veículo."}]
[null,11,"4.2 Custo Oportunidade [ % sobre o item 1.3 ] - Anual",7.0000000000000007E-2]
[]
[]
[]
[null,null,null,null,null,null,null,{"$f":"IFERROR(HYPERLINK(IFERROR(INDEX(TBL_TEXTOS_AJUDA[],CP_SELECAO_ITEM,MATCH(\"Link\",TBL_TEXTOS_AJUDA[#Headers],0)),\"\"),IFERROR(INDEX(TBL_TEXTOS_AJUDA[],CP_SELECAO_ITEM,MATCH(\"Link_Amigavel\",TBL_TEXTOS_AJUDA[#Headers],0)),\"\")),\"\")","v":"Veja o comparativo de Seguro da Quadro Rodas"}]

{"sheet":"2.Resultado","index":2,"n_rows":53,"n_cols":27,"rows_kept":53,"cut":false,"hidden":false,"merged":[[1,12,1,15],[37,2,37,6],[40,9,44,15],[26,1,26,15]]}
[]
[null,{"$f":"UPPER(CP_MODELO&\" - \"&\"Investimento em \"&N_CP_PRAZO_CONTRATO&\" meses\")","v":"POPULAR HATCH 1.0 MANUAL (COMPLETO) - INVESTIMENTO EM 36 MESES"}]
[]
["",null,"CUSTO FROTA PRÓPRIA","Ano 1","Ano 2","Ano 3","Total"]
[]
[null,"Aquisição","Custo Oportunidade",{"$f":"IF(N_CP_PRAZO_CONTRATO=12,-SUM('3.Fluxo_Caixa'!N22:BJ22),-SUM('3.Fluxo_Caixa'!N22:Y22))","v":2408.6116552389281},{"$f":"IF(N_CP_PRAZO_CONTRATO=12,0,IF(N_CP_PRAZO_CONTRATO=24,-SUM('3.Fluxo_Caixa'!Z22:BK22),-SUM('3.Fluxo_Caixa'!Z22:AK22)))","v":2408.6116552389281},{"$f":"IF(N_CP_PRAZO_CONTRATO=36,-SUM('3.Fluxo_Caixa'!AL22:BL22),0)","v":2408.6116552389281},{"$f":"ROUND(SUM(D6:F6),2)","v":7225.83}]
[null,"Depreciação","Saldo Compra e Venda",{"$f":"IF(N_CP_PRAZO_CONTRATO=12,-SUM('3.Fluxo_Caixa'!N20:BJ20)-SUM('3.Fluxo_Caixa'!N16:BJ16)-SUM('3.Fluxo_Caixa'!N19:BJ19),-SUM('3.Fluxo_Caixa'!N20:Y20)-SUM('3.Fluxo_Caixa'!N16:Y16)-SUM('3.Fluxo_Caixa'!N19:Y19))","v":7099.8400000000011},{"$f":"IF(N_CP_PRAZO_CONTRATO=12,0,IF(N_CP_PRAZO_CONTRATO=24,-SUM('3.Fluxo_Caixa'!Z20:BK20)-SUM('3.Fluxo_Caixa'!Z16:BK16)-SUM('3.Fluxo_Caixa'!Z19:BK19),-SUM('3.Fluxo_Caixa'!Z20:AK20)-SUM('3.Fluxo_Caixa'!Z16:AK16)-SUM('3.Fluxo_Caixa'!Z19:AK19)))","v":7099.8400000000011},{"$f":"IF(N_CP_PRAZO_CONTRATO=36,-SUM('3.Fluxo_Caixa'!AL20:BL20)-SUM('3.Fluxo_Caixa'!AL16:BL16)-SUM('3.Fluxo_Caixa'!AL19:BL19),0)","v":-5900.4799999999696},8299.2000000000007]
[null,"Custo Frota","IPVA + Licenciamento",{"$f":"IF(N_CP_PRAZO_CONTRATO=12,-SUM('3.Fluxo_Caixa'!N12:BJ12),-SUM('3.Fluxo_Caixa'!N12:Y12))","v":1597.4639999999997},{"$f":"IF(N_CP_PRAZO_CONTRATO=12,0,IF(N_CP_PRAZO_CONTRATO=24,-SUM('3.Fluxo_Caixa'!Z12:BK12),-SUM('3.Fluxo_Caixa'!Z12:AK12)))","v":1478.2259999999999},{"$f":"IF(N_CP_PRAZO_CONTRATO=36,-SUM('3.Fluxo_Caixa'!AL12:BL12),0)","v":1358.9880000000001},4434.68,null,null,null,null,null,null,null,null,null,null,null,null,null,null,null,null,null,"Frota Própria",{"$f":"$G$15","v":24832}]
[null,"Custo Frota","Seguro Anual",{"$f":"IF(N_CP_PRAZO_CONTRATO=12,-SUM('3.Fluxo_Caixa'!N11:BJ11),-SUM('3.Fluxo_Caixa'!N11:Y11))","v":1419.9679999999998},{"$f":"IF(N_CP_PRAZO_CONTRATO=12,0,IF(N_CP_PRAZO_CONTRATO=24,-SUM('3.Fluxo_Caixa'!Z11:BK11),-SUM('3.Fluxo_Caixa'!Z11:AK11)))","v":1313.9786666666666},{"$f":"IF(N_CP_PRAZO_CONTRATO=36,-SUM('3.Fluxo_Caixa'!AL11:BL11),0)","v":1207.9893333333334},3941.94,null,null,null,null,null,null,null,null,null,null,null,null,null,null,null,null,null,"Frota Locada",{"$f":"$G$22","v":29224.799999999999}]
[null,"Custo Frota","Frota Reserva",{"$f":"IF(N_CP_PRAZO_CONTRATO=12,-SUM('3.Fluxo_Caixa'!N15:BJ15),-SUM('3.Fluxo_Caixa'!N15:Y15))","v":484.08000000000015},{"$f":"IF(N_CP_PRAZO_CONTRATO=12,0,IF(N_CP_PRAZO_CONTRATO=24,-SUM('3.Fluxo_Caixa'!Z15:BK15),-SUM('3.Fluxo_Caixa'!Z15:AK15)))","v":484.08000000000015},{"$f":"IF(N_CP_PRAZO_CONTRATO=36,-SUM('3.Fluxo_Caixa'!AL15:BL15),0)","v":484.08000000000015},1452.24,null,null,null,null,null,null,null,null,null,null,null,null,null,null,null,null,null,"Economia em R$",{"$f":"Z8-Z9","v":-4392.7999999999993}]
[null,"Custo Frota","Manutenção",{"$f":"IF(N_CP_PRAZO_CONTRATO=12,-SUM('3.Fluxo_Caixa'!N13:Y13,'3.Fluxo_Caixa'!$M$17:$AX$17),-SUM('3.Fluxo_Caixa'!N13:Y13))","v":645.98400000000004},{"$f":"-IF(N_CP_PRAZO_CONTRATO=12,0,IF(N_CP_PRAZO_CONTRATO=36,SUM('3.Fluxo_Caixa'!Z13:AK13),SUM('3.Fluxo_Caixa'!Z13:AK13,'3.Fluxo_Caixa'!$M$17:$AX$17)))","v":645.98400000000004},{"$f":"IF(N_CP_PRAZO_CONTRATO<>36,0,-SUM('3.Fluxo_Caixa'!AL13:AW13,'3.Fluxo_Caixa'!$M$17:$AX$17))","v":1355.9839999999999},2647.95,null,null,null,null,null,null,null,null,null,null,null,null,null,null,null,null,null,"Economia em %",{"$f":"TEXT(Z10/Z8,\"0%\")","v":"-18%"}]
[null,"Custo Frota","Frete",{"$f":"IF(N_CP_PRAZO_CONTRATO=12,-SUM('3.Fluxo_Caixa'!$M$10:$BG$10,'3.Fluxo_Caixa'!$M$18:$BF$18),-SUM('3.Fluxo_Caixa'!$M$10:$BG$10))","v":150},{"$f":"IF(OR(N_CP_PRAZO_CONTRATO=12,N_CP_PRAZO_CONTRATO=36),0,-SUM('3.Fluxo_Caixa'!$M$18:$BF$18))","v":0},{"$f":"IF(N_CP_PRAZO_CONTRATO<36,0,IF(N_CP_PRAZO_CONTRATO=36,-SUM('3.Fluxo_Caixa'!$M$18:$BF$18,0)))","v":350},500]
[null,"Custos\nADM","Custo administrativo gestão da frota",{"$f":"IF(N_CP_PRAZO_CONTRATO=12,-SUM('3.Fluxo_Caixa'!N14:BJ14),-SUM('3.Fluxo_Caixa'!N14:Y14))","v":1800},{"$f":"IF(N_CP_PRAZO_CONTRATO=12,0,IF(N_CP_PRAZO_CONTRATO=24,-SUM('3.Fluxo_Caixa'!Z14:BK14),-SUM('3.Fluxo_Caixa'!Z14:AK14)))","v":1800},{"$f":"IF(N_CP_PRAZO_CONTRATO=36,-SUM('3.Fluxo_Caixa'!AL14:BL14),0)","v":1800},5400,null,null,null,null,null,null,null,null,null,null,null,null,null,null,null,null,null,"Custo Frota",{"$f":"SUMIF($B$6:$B$14,Y13,$G$6:$G$14)","v":12976.810000000001},{"$f":"Z13/$Z$17","v":0.38277597912089728}]
[null,"-","Imposto de Renda + Contribuição Social",{"$f":"IF(N_CP_PRAZO_CONTRATO=12,-SUM('3.Fluxo_Caixa'!N21:BJ21),-SUM('3.Fluxo_Caixa'!N21:Y21))","v":-4487.0942400000004},{"$f":"IF(N_CP_PRAZO_CONTRATO=12,0,IF(N_CP_PRAZO_CONTRATO=24,-SUM('3.Fluxo_Caixa'!Z21:BK21),-SUM('3.Fluxo_Caixa'!Z21:AK21)))","v":-4359.5169466666675},{"$f":"IF(N_CP_PRAZO_CONTRATO=36,-SUM('3.Fluxo_Caixa'!AL21:BL21),0)","v":-223.23085333334438},-9069.84,null,null,null,null,null,null,null,null,null,null,null,null,null,null,null,null,null,"Depreciação",{"$f":"SUMIF($B$6:$B$14,Y14,$G$6:$G$14)","v":8299.2000000000007},{"$f":"Z14/$Z$17","v":0.24480087216505061}]
[null,null,"Custo Total Operação",{"$f":"SUM(D6:D14)","v":11118.853415238929},{"$f":"SUM(E6:E14)","v":10871.203375238929},{"$f":"SUM(F6:F14)","v":2841.9421352389472},{"$f":"ROUND(SUM(D15:F15),2)","v":24832},null,null,null,null,null,null,null,null,null,null,null,null,null,null,null,null,null,"Aquisição",{"$f":"SUMIF($B$6:$B$14,Y15,$G$6:$G$14)","v":7225.83},{"$f":"Z15/$Z$17","v":0.21313975878595379}]
[null,null,null,null,null,null,null,null,null,null,null,null,null,null,null,null,null,null,null,null,null,null,null,null,"Custos\nADM",{"$f":"SUMIF($B$6:$B$14,Y16,$G$6:$G$14)","v":5400},{"$f":"Z16/$Z$17","v":0.15928338992809829}]
[null,null,null,null,null,null,null,null,null,null,null,null,null,null,null,null,null,null,null,null,null,null,null,null,null,{"$f":"SUM(Z13:Z16)","v":33901.840000000004}]
["",null,"CUSTO FROTA LOCADA","Ano 1","Ano 2","Ano 3","Total"]
[]
[null,null,"Valor aluguel",{"$f":"-SUM('3.Fluxo_Caixa'!N31:Y31)","v":14760},{"$f":"-SUM('3.Fluxo_Caixa'!Z31:AK31)","v":14760},{"$f":"-SUM('3.Fluxo_Caixa'!AL31:AW31)","v":14760},{"$f":"ROUND(SUM(D20:F20),2)","v":44280}]
[null,null,"Imposto de Renda + Contribuição Social",{"$f":"-SUM('3.Fluxo_Caixa'!N32:Y32)","v":-5018.3999999999987},{"$f":"-SUM('3.Fluxo_Caixa'!Z32:AK32)","v":-5018.3999999999987},{"$f":"-SUM('3.Fluxo_Caixa'!AL32:AW32)","v":-5018.3999999999987},-15055.2]
[null,null,"Valor total aluguel líquido",{"$f":"SUM(D20:D21)","v":9741.6000000000022},{"$f":"SUM(E20:E21)","v":9741.6000000000022},{"$f":"SUM(F20:F21)","v":9741.6000000000022},{"$f":"ROUND(SUM(D22:F22),2)","v":29224.799999999999}]
[]
[]
[]
[]
[null,"A simulação foi feita com base numa operação padrão e valores médios de mercado, possuindo, portanto, caráter meramente ilustrativo. Assim, os valores apresentados na simulação não se constituem em proposta, tão pouco vinculam a Easy fleet para quaisquer fins. Para obter maiores detalhes sobre terceirização e gestão de frota, bem como obter proposta de preços, agende uma visita com um de nossos consultores que poderá esclarecer todas as dúvidas e enviar uma proposta de acordo com as condições específicas de uso dos veículos para sua empresa."]
[]
[]
["",null,"VANTAGENS DA TERCEIRIZAÇÃO"]
[]
[""]
[]
[]
[]
[]
[]
[]
[]
["",null,"DIFERENCIAIS EASY FLEET",null,null,null,null,null,null,"TERCEIRIZAR JÁ É UMA TENDÊNCIA NO MERCADO...."]
[]
[]
[]
[]
[]
[]
[]
[]
[]
[]
[]
[]
[null,""]

{"sheet":"3.Fluxo_Caixa","index":3,"n_rows":33,"n_cols":60,"rows_kept":33,"cut":false,"hidden":true,"merged":[[4,2,5,2],[4,5,4,9],[4,12,4,16]]}
[]
[]
[]
[null,null,null,null,null,null,null,null,null,null,null,null,"Ano 0","Ano 1","Ano 1","Ano 1","Ano 1","Ano 1","Ano 1","Ano 1","Ano 1","Ano 1","Ano 1","Ano 1","Ano 1","Ano 2","Ano 2","Ano 2","Ano 2","Ano 2","Ano 2","Ano 2","Ano 2","Ano 2","Ano 2","Ano 2","Ano 2","Ano 3","Ano 3","Ano 3","Ano 3","Ano 3","Ano 3","Ano 3","Ano 3","Ano 3","Ano 3","Ano 3","Ano 3","Ano 4"]
[null,null,{"$f":"CP_MODELO","v":"Popular Hatch 1.0 Manual (Completo)"},null,null,"FLUXO DE CAIXA ANUAL",null,null,null,null,null,null,"FLUXO DE CAIXA MENSAL"]
[null,null,null,"Premissa","Frequência","Ano 0","Ano 1","Ano 2","Ano 3","Ano 4","Total",null,"Mês 0",{"$f":"IF(M7<=N_CP_PRAZO_CONTRATO,M7+1,0)","v":1},{"$f":"IF(N6<=N_CP_PRAZO_CONTRATO,IF(N6=0,0,N6+1),0)","v":2},3,4,5,6,7,8,9,10,11,12,13,14,15,16,17,18,19,20,21,22,23,24,25,26,27,28,29,30,31,32,33,34,35,36,37]
[null,null,"CUSTO FROTA PRÓPRIA",null,null,null,null,null,null,null,null,null,0]
[]
[null,null,"1.3 Valor da compra com desconto",{"$f":"N_CP_VALOR_COMPRA_VEICULO_COM_DESCONTO","v":35499.199999999997},"Único",{"$f":"SUMIF($M$4:$AX$4,F$6,$M9:$AX9)","v":-35499.199999999997},{"$f":"SUMIF($M$4:$AX$4,G$6,$M9:$AX9)","v":0},0,0,0,{"$f":"SUM(F9:J9)","v":-35499.199999999997},null,{"$f":"N_CP_VALOR_COMPRA_VEICULO_COM_DESCONTO*-1","v":-35499.199999999997}]
[null,null,"1.4 Frete entrega do veículo",{"$f":"N_CP_FRETE_ENTREGA","v":150},"Único",{"$f":"SUMIF($M$4:$AX$4,F$6,$M10:$AX10)","v":0},-150,0,0,0,{"$f":"SUM(F10:J10)","v":-150},null,null,{"$f":"IF(N6=1,-N_CP_FRETE_ENTREGA,0)","v":-150},0,0,0,0,0,0,0,0,0,0,0,0,0,0,0,0,0,0,0,0,0,0,0,0,0,0,0,0,0,0,0,0,0,0,0,0,0,0,0,0,0,0,0,0,0]
[null,null,"2.1 Contratação de Seguro",{"$f":"N_CP_SEGURO_ANUAL","v":0.04},"Anual",0,-1419.9679999999998,-1313.9786666666666,-1207.9893333333334,0,-3941.9360000000001,null,null,{"$f":"-N_CP_VALOR_COMPRA_VEICULO_COM_DESCONTO*N_CP_SEGURO_ANUAL","v":-1419.9679999999998},0,0,0,0,0,0,0,0,0,0,0,{"$f":"-IF(AA6=0,0,Z26*N_CP_SEGURO_ANUAL)","v":-1313.9786666666666},0,0,0,0,0,0,0,0,0,0,0,{"$f":"-IF(AM6=0,0,AL26*N_CP_SEGURO_ANUAL)","v":-1207.9893333333334},0,0,0,0,0,0,0,0,0,0,0,{"$f":"-IF(AY4=0,0,N_CP_VALOR_COMPRA_VEICULO_COM_DESCONTO-((N_CP_VALOR_COMPRA_VEICULO_COM_DESCONTO-N_CP_VALOR_ESTIMADO_VENDA_VEICULO)/N_CP_PRAZO_CONTRATO)*AW6)*N_CP_SEGURO_ANUAL","v":0},0,0,0,0,0,0,0,0,0]
[null,null,"2.2 IPVA + Licenciamento",{"$f":"N_CP_LICENCIAMENTO","v":4.4999999999999998E-2},"Anual",0,-1597.4639999999997,-1478.2259999999999,-1358.9880000000001,0,-4434.6779999999999,null,null,{"$f":"-N_CP_VALOR_COMPRA_VEICULO_COM_DESCONTO*N_CP_LICENCIAMENTO","v":-1597.4639999999997},0,0,0,0,0,0,0,0,0,0,0,{"$f":"-IF(Z6=0,0,Z26*N_CP_LICENCIAMENTO)","v":-1478.2259999999999},0,0,0,0,0,0,0,0,0,0,0,{"$f":"-IF(AL6=0,0,AL26*N_CP_LICENCIAMENTO)","v":-1358.9880000000001},0,0,0,0,0,0,0,0,0,0,0,null,0,0,0,0,0,0,0,0,0]
[null,null,"2.3 Manutenção Preventiva e Corretiva",{"$f":"N_CP_MANUTENCAO_PREVENTIVA_CORRETIVA","v":645.98400000000004},"Anual",0,-645.98400000000004,-645.98400000000004,-645.98400000000004,0,-1937.9520000000002,null,null,{"$f":"IF(O6=0,0,-N_CP_MANUTENCAO_PREVENTIVA_CORRETIVA)/12","v":-53.832000000000001},-53.832000000000001,-53.832000000000001,-53.832000000000001,-53.832000000000001,-53.832000000000001,-53.832000000000001,-53.832000000000001,-53.832000000000001,-53.832000000000001,-53.832000000000001,-53.832000000000001,-53.832000000000001,-53.832000000000001,-53.832000000000001,-53.832000000000001,-53.832000000000001,-53.832000000000001,-53.832000000000001,-53.832000000000001,-53.832000000000001,-53.832000000000001,-53.832000000000001,-53.832000000000001,-53.832000000000001,-53.832000000000001,-53.832000000000001,-53.832000000000001,-53.832000000000001,-53.832000000000001,-53.832000000000001,-53.832000000000001,-53.832000000000001,-53.832000000000001,-53.832000000000001,-53.832000000000001,{"$f":"IF(AY6=0,0,-N_CP_MANUTENCAO_PREVENTIVA_CORRETIVA)","v":0},0,0,0,0,0,0,{"$f":"IF(AND(BF4>0,BG4=0),-N_CP_VALOR_COMPRA_VEICULO_COM_DESCONTO*N_CP_MANUTENCAO_PARA_VENDA-N_CP_MANUTENCAO_PREVENTIVA_CORRETIVA,IF(BF4=0,0,-N_CP_MANUTENCAO_PREVENTIVA_CORRETIVA))","v":0},{"$f":"IF(AND(BG4>0,BH4=0),-N_CP_VALOR_COMPRA_VEICULO_COM_DESCONTO*N_CP_MANUTENCAO_PARA_VENDA-N_CP_MANUTENCAO_PREVENTIVA_CORRETIVA,IF(BG4=0,0,-N_CP_MANUTENCAO_PREVENTIVA_CORRETIVA))","v":0},{"$f":"IF(AND(BH4>0,BI4=0),-N_CP_VALOR_COMPRA_VEICULO_COM_DESCONTO*N_CP_MANUTENCAO_PARA_VENDA-N_CP_MANUTENCAO_PREVENTIVA_CORRETIVA,IF(BH4=0,0,-N_CP_MANUTENCAO_PREVENTIVA_CORRETIVA))","v":0}]
[null,null,"2.4 Custo administrativo com a gestão da frota",{"$f":"N_CP_CUSTOS_ADM","v":1800},"Anual",0,-1800,-1800,-1800,0,-5400,null,null,{"$f":"IF(O6=0,0,-N_CP_CUSTOS_ADM)/12","v":-150},-150,-150,-150,-150,-150,-150,-150,-150,-150,-150,-150,-150,-150,-150,-150,-150,-150,-150,-150,-150,-150,-150,-150,-150,-150,-150,-150,-150,-150,-150,-150,-150,-150,-150,-150,{"$f":"IF(AY4=0,0,-N_CP_CUSTOS_ADM)","v":0},0,0,0,0,0,0,0,0,0]
[null,null,"2.5 Frota reserva (Locações eventuais)",{"$f":"N_CP_FROTA_RESERVA","v":484.08000000000004},"Anual",0,-484.08000000000015,-484.08000000000015,-484.08000000000015,0,-1452.2400000000005,null,null,{"$f":"IF(O6=0,0,-N_CP_FROTA_RESERVA/12)","v":-40.340000000000003},-40.340000000000003,-40.340000000000003,-40.340000000000003,-40.340000000000003,-40.340000000000003,-40.340000000000003,-40.340000000000003,-40.340000000000003,-40.340000000000003,-40.340000000000003,-40.340000000000003,-40.340000000000003,-40.340000000000003,-40.340000000000003,-40.340000000000003,-40.340000000000003,-40.340000000000003,-40.340000000000003,-40.340000000000003,-40.340000000000003,-40.340000000000003,-40.340000000000003,-40.340000000000003,-40.340000000000003,-40.340000000000003,-40.340000000000003,-40.340000000000003,-40.340000000000003,-40.340000000000003,-40.340000000000003,-40.340000000000003,-40.340000000000003,-40.340000000000003,-40.340000000000003,-40.340000000000003,{"$f":"IF(AY4=0,0,-N_CP_VALOR_COMPRA_VEICULO_COM_DESCONTO*N_CP_FROTA_RESERVA)","v":0},0,0,0,0,0,0,0,0,0]
[null,null,"3.2 Custos do processo de venda",{"$f":"N_CP_CUSTO_PROCESSO_VENDA_VEICULO","v":350},"Último mês",0,0,0,0,-350,-350,null,null,{"$f":"-IF(N6=N_CP_PRAZO_CONTRATO+1,N_CP_CUSTO_PROCESSO_VENDA_VEICULO*N26,0)","v":0},0,0,0,0,0,0,0,0,0,0,0,{"$f":"-IF(Z6=N_CP_PRAZO_CONTRATO+1,N_CP_CUSTO_PROCESSO_VENDA_VEICULO,0)","v":0},0,0,0,0,0,0,0,0,0,0,0,{"$f":"-IF(AL6=N_CP_PRAZO_CONTRATO+1,N_CP_CUSTO_PROCESSO_VENDA_VEICULO,0)","v":0},0,0,0,0,0,0,0,0,0,0,0,{"$f":"-IF(AX6=N_CP_PRAZO_CONTRATO+1,N_CP_CUSTO_PROCESSO_VENDA_VEICULO,0)","v":-350},0,0,0,0,0,0,0,0,0]
[null,null,"3.3 Manutenção para venda",{"$f":"N_CP_MANUTENCAO_PARA_VENDA","v":710},"Último mês",0,0,0,-710,0,-710,null,null,{"$f":"IF(AND(O6>0,P6=0),-N_CP_MANUTENCAO_PARA_VENDA,0)","v":0},0,0,0,0,0,0,0,0,0,0,0,0,0,0,0,0,0,0,0,0,0,0,0,0,0,0,0,0,0,0,0,0,0,0,-710,0,0,0,0,{"$f":"IF(AND(BC6>0,BD6=0),-N_CP_VALOR_COMPRA_VEICULO_COM_DESCONTO*N_CP_MANUTENCAO_PARA_VENDA,0)","v":0},0,0,0]
[null,null,"3.4 Frete desmobilização do veículo",{"$f":"N_CP_FRETE_DESMOBILIZACAO","v":350},"Último mês",0,0,0,-350,0,-350,null,null,{"$f":"IF(N6=N_CP_PRAZO_CONTRATO,-N_CP_FRETE_DESMOBILIZACAO,0)","v":0},0,0,0,0,0,0,0,0,0,0,0,0,0,0,0,0,0,0,0,0,0,0,0,0,0,0,0,0,0,0,0,0,0,0,-350,0,0,0,0,0,0,0,0,0]
[null,null,"Valor Recuperado na Venda",null,null,0,0,{"$f":"IF(N_CP_PRAZO_CONTRATO=12,H26-G25,0)","v":0},{"$f":"IF(N_CP_PRAZO_CONTRATO=24,I26-H25,0)","v":0},{"$f":"IF(N_CP_PRAZO_CONTRATO=36,J26-I25,0)","v":13350.319999999971},{"$f":"SUM(F19:J19)","v":13350.319999999971},null,null,{"$f":"IF(N6=N_CP_PRAZO_CONTRATO+1,N_CP_VALOR_ESTIMADO_VENDA_VEICULO-(N_CP_VALOR_COMPRA_VEICULO_COM_DESCONTO+SUM(#REF!)),0)","v":0},{"$f":"IF(O6=N_CP_PRAZO_CONTRATO+1,N_CP_VALOR_ESTIMADO_VENDA_VEICULO-(N_CP_VALOR_COMPRA_VEICULO_COM_DESCONTO+SUM($M$20:N20)),0)","v":0},{"$f":"IF(P6=N_CP_PRAZO_CONTRATO+1,N_CP_VALOR_ESTIMADO_VENDA_VEICULO-(N_CP_VALOR_COMPRA_VEICULO_COM_DESCONTO+SUM($M$20:O20)),0)","v":0},{"$f":"IF(Q6=N_CP_PRAZO_CONTRATO+1,N_CP_VALOR_ESTIMADO_VENDA_VEICULO-(N_CP_VALOR_COMPRA_VEICULO_COM_DESCONTO+SUM($M$20:P20)),0)","v":0},{"$f":"IF(R6=N_CP_PRAZO_CONTRATO+1,N_CP_VALOR_ESTIMADO_VENDA_VEICULO-(N_CP_VALOR_COMPRA_VEICULO_COM_DESCONTO+SUM($M$20:Q20)),0)","v":0},{"$f":"IF(S6=N_CP_PRAZO_CONTRATO+1,N_CP_VALOR_ESTIMADO_VENDA_VEICULO-(N_CP_VALOR_COMPRA_VEICULO_COM_DESCONTO+SUM($M$20:R20)),0)","v":0},{"$f":"IF(T6=N_CP_PRAZO_CONTRATO+1,N_CP_VALOR_ESTIMADO_VENDA_VEICULO-(N_CP_VALOR_COMPRA_VEICULO_COM_DESCONTO+SUM($M$20:S20)),0)","v":0},{"$f":"IF(U6=N_CP_PRAZO_CONTRATO+1,N_CP_VALOR_ESTIMADO_VENDA_VEICULO-(N_CP_VALOR_COMPRA_VEICULO_COM_DESCONTO+SUM($M$20:T20)),0)","v":0},{"$f":"IF(V6=N_CP_PRAZO_CONTRATO+1,N_CP_VALOR_ESTIMADO_VENDA_VEICULO-(N_CP_VALOR_COMPRA_VEICULO_COM_DESCONTO+SUM($M$20:U20)),0)","v":0},{"$f":"IF(W6=N_CP_PRAZO_CONTRATO+1,N_CP_VALOR_ESTIMADO_VENDA_VEICULO-(N_CP_VALOR_COMPRA_VEICULO_COM_DESCONTO+SUM($M$20:V20)),0)","v":0},{"$f":"IF(X6=N_CP_PRAZO_CONTRATO+1,N_CP_VALOR_ESTIMADO_VENDA_VEICULO-(N_CP_VALOR_COMPRA_VEICULO_COM_DESCONTO+SUM($M$20:W20)),0)","v":0},{"$f":"IF(Y6=N_CP_PRAZO_CONTRATO+1,N_CP_VALOR_ESTIMADO_VENDA_VEICULO-(N_CP_VALOR_COMPRA_VEICULO_COM_DESCONTO+SUM($M$20:X20)),0)","v":0},{"$f":"IF(Z6=N_CP_PRAZO_CONTRATO+1,Z26-Y25,0)","v":0},null,null,null,null,null,null,null,null,null,null,null,{"$f":"IF(AL6=N_CP_PRAZO_CONTRATO+1,AL26-AK25,0)","v":0},null,null,null,null,null,null,null,null,null,null,null,{"$f":"IF(AX6=N_CP_PRAZO_CONTRATO+1,AX26-AW25,0)","v":13350.319999999971},{"$f":"IF(AY4=N_CP_PRAZO_CONTRATO+1,N_CP_VALOR_ESTIMADO_VENDA_VEICULO-(N_CP_VALOR_COMPRA_VEICULO_COM_DESCONTO+SUM($M$20:AX20)),0)","v":0},{"$f":"IF(AZ4=N_CP_PRAZO_CONTRATO+1,N_CP_VALOR_ESTIMADO_VENDA_VEICULO-(N_CP_VALOR_COMPRA_VEICULO_COM_DESCONTO+SUM($M$20:AY20)),0)","v":0},{"$f":"IF(BA4=N_CP_PRAZO_CONTRATO+1,N_CP_VALOR_ESTIMADO_VENDA_VEICULO-(N_CP_VALOR_COMPRA_VEICULO_COM_DESCONTO+SUM($M$20:AZ20)),0)","v":0},{"$f":"IF(BB4=N_CP_PRAZO_CONTRATO+1,N_CP_VALOR_ESTIMADO_VENDA_VEICULO-(N_CP_VALOR_COMPRA_VEICULO_COM_DESCONTO+SUM($M$20:BA20)),0)","v":0},{"$f":"IF(BC4=N_CP_PRAZO_CONTRATO+1,N_CP_VALOR_ESTIMADO_VENDA_VEICULO-(N_CP_VALOR_COMPRA_VEICULO_COM_DESCONTO+SUM($M$20:BB20)),0)","v":0},{"$f":"IF(BD4=N_CP_PRAZO_CONTRATO+1,N_CP_VALOR_ESTIMADO_VENDA_VEICULO-(N_CP_VALOR_COMPRA_VEICULO_COM_DESCONTO+SUM($M$20:BC20)),0)","v":0},{"$f":"IF(BE4=N_CP_PRAZO_CONTRATO+1,N_CP_VALOR_ESTIMADO_VENDA_VEICULO-(N_CP_VALOR_COMPRA_VEICULO_COM_DESCONTO+SUM($M$20:BD20)),0)","v":0},{"$f":"IF(BF4=N_CP_PRAZO_CONTRATO+1,N_CP_VALOR_ESTIMADO_VENDA_VEICULO-(N_CP_VALOR_COMPRA_VEICULO_COM_DESCONTO+SUM($M$20:BE20)),0)","v":0},{"$f":"IF(BG4=N_CP_PRAZO_CONTRATO+1,N_CP_VALOR_ESTIMADO_VENDA_VEICULO-(N_CP_VALOR_COMPRA_VEICULO_COM_DESCONTO+SUM($M$20:BF20)),0)","v":0}]
[null,null,"Depreciação Contábil",0.2,"Anual",0,-7099.8400000000011,-7099.8400000000011,-7099.8400000000011,0,-21299.520000000004,null,null,{"$f":"IF(O6=0,0,-(N_CP_VALOR_COMPRA_VEICULO_COM_DESCONTO*N_CP_DEPRECIACAO_CONTABIL/12))","v":-591.65333333333331},-591.65333333333331,-591.65333333333331,-591.65333333333331,-591.65333333333331,-591.65333333333331,-591.65333333333331,-591.65333333333331,-591.65333333333331,-591.65333333333331,-591.65333333333331,-591.65333333333331,-591.65333333333331,-591.65333333333331,-591.65333333333331,-591.65333333333331,-591.65333333333331,-591.65333333333331,-591.65333333333331,-591.65333333333331,-591.65333333333331,-591.65333333333331,-591.65333333333331,-591.65333333333331,-591.65333333333331,-591.65333333333331,-591.65333333333331,-591.65333333333331,-591.65333333333331,-591.65333333333331,-591.65333333333331,-591.65333333333331,-591.65333333333331,-591.65333333333331,-591.65333333333331,-591.65333333333331,{"$f":"IF(AY4=0,0,-(N_CP_VALOR_COMPRA_VEICULO_COM_DESCONTO*N_CP_DEPRECIACAO_CONTABIL/12))","v":0},0,0,0,0,0,0,0,0,0]
[null,null,"4.1 Imposto de Renda + Contribuição Social ",{"$f":"N_CP_ALIQUOTA_IR","v":0.34},"Anual",0,{"$f":"SUM(G8:G20)*N_CP_ALIQUOTA_IR*-1","v":4487.0942400000004},4359.5169466666675,4643.3396533333344,-4420.10879999999,9069.8420400000141,null,null,{"$f":"SUM(N8:N20)*N_CP_ALIQUOTA_IR*-1","v":1361.1074933333334},284.18061333333333,284.18061333333333,284.18061333333333,284.18061333333333,284.18061333333333,284.18061333333333,284.18061333333333,284.18061333333333,284.18061333333333,284.18061333333333,284.18061333333333,1233.5301999999999,284.18061333333333,284.18061333333333,284.18061333333333,284.18061333333333,284.18061333333333,284.18061333333333,284.18061333333333,{"$f":"SUM(AH8:AH20)*N_CP_ALIQUOTA_IR*-1","v":284.18061333333333},284.18061333333333,284.18061333333333,284.18061333333333,1156.9529066666666,284.18061333333333,284.18061333333333,284.18061333333333,284.18061333333333,284.18061333333333,284.18061333333333,284.18061333333333,284.18061333333333,284.18061333333333,284.18061333333333,644.5806133333333,{"$f":"SUM(AX8:AX20)*N_CP_ALIQUOTA_IR*-1","v":-4420.10879999999},0,0,0,0,0,0,0,0,0]
[null,null,"4.2 Custo Oportunidade",{"$f":"N_CP_CUSTO_OPORTUNIDADE","v":7.0000000000000007E-2},"Anual",0,-2408.6116552389281,-2408.6116552389281,-2408.6116552389281,0,-7225.8349657167837,null,null,{"$f":"IF(O6=0,0,-N_CP_VALOR_COMPRA_VEICULO_COM_DESCONTO*((1+N_CP_CUSTO_OPORTUNIDADE)^(1/12)-1))","v":-200.71763793657729},-200.71763793657729,-200.71763793657729,-200.71763793657729,-200.71763793657729,-200.71763793657729,-200.71763793657729,-200.71763793657729,-200.71763793657729,-200.71763793657729,-200.71763793657729,-200.71763793657729,-200.71763793657729,-200.71763793657729,-200.71763793657729,-200.71763793657729,-200.71763793657729,-200.71763793657729,-200.71763793657729,-200.71763793657729,-200.71763793657729,-200.71763793657729,-200.71763793657729,-200.71763793657729,-200.71763793657729,-200.71763793657729,-200.71763793657729,-200.71763793657729,-200.71763793657729,-200.71763793657729,-200.71763793657729,-200.71763793657729,-200.71763793657729,-200.71763793657729,-200.71763793657729,-200.71763793657729,0,0,0,0,0,0,0,0,0,0]
[null,null,"Total  Mês",null,null,0,-11118.853415238929,-10871.203375238929,-11422.153335238931,8580.2111999999797,-24831.998925716809,null,null,{"$f":"SUM(N10:N22)","v":-2842.867477936577},{"$f":"SUM(O10:O22)","v":-752.36235793657727},-752.36235793657727,-752.36235793657727,-752.36235793657727,-752.36235793657727,-752.36235793657727,-752.36235793657727,-752.36235793657727,-752.36235793657727,-752.36235793657727,-752.36235793657727,-2595.217437936577,-752.36235793657727,-752.36235793657727,-752.36235793657727,-752.36235793657727,-752.36235793657727,-752.36235793657727,-752.36235793657727,-752.36235793657727,-752.36235793657727,-752.36235793657727,-752.36235793657727,-2446.5673979365774,-752.36235793657727,-752.36235793657727,-752.36235793657727,-752.36235793657727,-752.36235793657727,-752.36235793657727,-752.36235793657727,-752.36235793657727,-752.36235793657727,-752.36235793657727,-1451.9623579365773,8580.2111999999797]
[null,null,null,null,null,0,0,0,0,0,0]
[null,null,"Valor do veiculo com Depreciação Contábil ",null,null,null,{"$f":"IF(N_CP_PRAZO_CONTRATO=12,Y25,0)","v":0},{"$f":"IF(N_CP_PRAZO_CONTRATO=24,AK25,0)","v":0},{"$f":"IF(N_CP_PRAZO_CONTRATO=36,AW25,0)","v":14199.680000000029},null,14199.680000000029,null,{"$f":"IF(N6=0,0,M9*-1)","v":35499.199999999997},{"$f":"IF(O6=0,0,M25+N20)","v":34907.546666666662},34315.893333333326,33724.239999999991,33132.586666666655,32540.933333333323,31949.279999999992,31357.62666666666,30765.973333333328,30174.319999999996,29582.666666666664,28991.013333333332,28399.360000000001,27807.706666666669,27216.053333333337,26624.400000000005,26032.746666666673,25441.093333333341,24849.44000000001,24257.786666666678,23666.133333333346,23074.480000000014,22482.826666666682,21891.17333333335,21299.520000000019,20707.866666666687,20116.213333333355,19524.560000000023,18932.906666666691,18341.253333333359,17749.600000000028,17157.946666666696,16566.293333333364,15974.64000000003,15382.986666666697,14791.333333333363,14199.680000000029,0,0,0,0,0,0,0,0,0,0,0]
[null,null,"3.1 Valor Estimado para a venda do veículo",null,null,null,null,{"$f":"IF(N_CP_PRAZO_CONTRATO=12,Z26)","v":false},{"$f":"IF(N_CP_PRAZO_CONTRATO=24,AL26)","v":false},{"$f":"IF(N_CP_PRAZO_CONTRATO=36,AX26)","v":27550},27550,null,null,null,null,null,null,null,null,null,null,null,null,null,null,{"$f":"N_CP_VALOR_COMPRA_VEICULO_COM_DESCONTO-((N_CP_VALOR_COMPRA_VEICULO_COM_DESCONTO-N_CP_VALOR_ESTIMADO_VENDA_VEICULO)/N_CP_PRAZO_CONTRATO)*Y6","v":32849.466666666667},null,null,null,null,null,null,null,null,null,null,null,{"$f":"N_CP_VALOR_COMPRA_VEICULO_COM_DESCONTO-((N_CP_VALOR_COMPRA_VEICULO_COM_DESCONTO-N_CP_VALOR_ESTIMADO_VENDA_VEICULO)/N_CP_PRAZO_CONTRATO)*AK6","v":30199.733333333334},null,null,null,null,null,null,null,null,null,null,null,{"$f":"N_CP_VALOR_COMPRA_VEICULO_COM_DESCONTO-((N_CP_VALOR_COMPRA_VEICULO_COM_DESCONTO-N_CP_VALOR_ESTIMADO_VENDA_VEICULO)/N_CP_PRAZO_CONTRATO)*AW6","v":27550}]
[null,null,null,null,null,{"$f":"SUMIF($M$4:$AX$4,F$6,$M27:$AX27)","v":0},0,0,0,0,0]
[]
[null,null,"CUSTO FROTA TERCEIRIZADA",null,null,null,null,null,null,null,null,null,"Mês 0",1,{"$f":"IF(N29<=N_CP_PRAZO_CONTRATO,IF(N29=0,0,N29+1),0)","v":2},3,4,5,6,7,8,9,10,11,12,13,14,15,16,17,18,19,20,21,22,23,24,25,26,27,28,29,30,31,32,33,34,35,36,37]
[null,null,null,null,null,null,null,null,null,null,null,null,null,null,null,null,null,null,null,null,null,null,null,null,null,null,null,null,null,null,null,null,null,null,null,null,null,null,null,null,null,null,null,null,null,null,null,null,null,null,{"$f":"IF(AX29<=N_CP_PRAZO_CONTRATO,IF(AX29=0,0,AX29+1),0)","v":0},{"$f":"IF(AY30<=N_CP_PRAZO_CONTRATO,IF(AY30=0,0,AY30+1),0)","v":0},0,0,0,0,0,0,0]
[null,null,"Aluguel Mensal",{"$f":"N_CP_VALOR_ALUGUEL_MENSAL","v":1230},"Mensal",{"$f":"SUMIF($M$4:$AX$4,F$6,$M31:$AX31)","v":0},-14760,-14760,-14760,0,{"$f":"SUM(F31:J31)","v":-44280},null,null,{"$f":"IF(O6=0,0,-N_CP_VALOR_ALUGUEL_MENSAL)","v":-1230},{"$f":"IF(P29=0,0,-N_CP_VALOR_ALUGUEL_MENSAL)","v":-1230},-1230,-1230,-1230,-1230,-1230,-1230,-1230,-1230,-1230,-1230,-1230,-1230,-1230,-1230,-1230,-1230,-1230,-1230,-1230,-1230,-1230,-1230,-1230,-1230,-1230,-1230,-1230,-1230,-1230,-1230,-1230,-1230,-1230,-1230,{"$f":"IF(AY30=0,0,-N_CP_VALOR_ALUGUEL_MENSAL)","v":0},0,0,0,0,0,0,0,0,0]
[null,null,"4.1 Imposto de Renda + Contribuição Social ",{"$f":"N_CP_ALIQUOTA_IR","v":0.34},"Anual",0,5018.3999999999987,5018.3999999999987,5018.3999999999987,0,15055.199999999997,null,null,{"$f":"-SUM(N31:N31)*N_CP_ALIQUOTA_IR","v":418.20000000000005},418.20000000000005,418.20000000000005,418.20000000000005,418.20000000000005,418.20000000000005,418.20000000000005,418.20000000000005,418.20000000000005,418.20000000000005,418.20000000000005,418.20000000000005,418.20000000000005,418.20000000000005,418.20000000000005,418.20000000000005,418.20000000000005,418.20000000000005,418.20000000000005,418.20000000000005,418.20000000000005,418.20000000000005,418.20000000000005,418.20000000000005,418.20000000000005,418.20000000000005,418.20000000000005,418.20000000000005,418.20000000000005,418.20000000000005,418.20000000000005,418.20000000000005,418.20000000000005,418.20000000000005,418.20000000000005,418.20000000000005,0,0,0,0,0,0,0,0,0,0]
[null,null,"Total  Mês",null,null,0,-9741.6,-9741.6,-9741.6,0,{"$f":"SUM(F33:J33)","v":-29224.800000000003},null,null,{"$f":"+SUM(N31:N32)","v":-811.8},-811.8,-811.8,-811.8,-811.8,-811.8,-811.8,-811.8,-811.8,-811.8,-811.8,-811.8,-811.8,-811.8,-811.8,-811.8,-811.8,-811.8,-811.8,-811.8,-811.8,-811.8,-811.8,-811.8,-811.8,-811.8,-811.8,-811.8,-811.8,-811.8,-811.8,-811.8,-811.8,-811.8,-811.8,-811.8,0,0,0,0,0,0,0,0,0,0]

{"sheet":"Dados","index":4,"n_rows":45,"n_cols":13,"rows_kept":45,"cut":false,"hidden":true,"merged":[]}
[null,null,1,2,3,4,5,6,7,8,9,10,11]
["Selecionado","Item","Popular Hatch 1.0 Manual (Completo)","Popular Sedan 1.0 Manual (Completo)","Popular Hatch 1.4 Manual (Completo)","Popular Sedan 1.4 Manual (Completo)","Pick-up Leve CS 1.4","Pick-up Leve CD 1.4","Utilitário Furgão 1.4 ","Executivo Hatch Manual 1.6","Executivo Sedan Automático 2.0","Caminhonete CS 4x4","Caminhonete CD 4x2"]
[{"$f":"VLOOKUP(B3,$B:$M,CP_ID_MODELO+1,0)","v":40340},"1.1 Valor de mercado do veículo",40340,44390,48040,51650,46900,64266,54040,73790,94300,114890,135760]
[{"$f":"VLOOKUP(B4,$B:$M,CP_ID_MODELO+1,0)","v":0.12},"1.2 % desconto na compra",0.12,0.12,0.12,0.12,0.12,0.12,0.08,0.08,0.08,0.08,0.08]
[]
[{"$f":"VLOOKUP(B6,$B:$M,CP_ID_MODELO+1,0)","v":150},"1.4 Frete entrega do veículo",150,150,150,150,150,150,150,150,150,150,150]
[]
[{"$f":"VLOOKUP(B8,$B:$M,CP_ID_MODELO+1,0)","v":0.04},"2.1 Seguro  - Anual",0.04,0.04,0.04,0.04,0.04,0.04,0.04,0.04,0.04,0.04,0.04]
[{"$f":"VLOOKUP(B9,$B:$M,CP_ID_MODELO+1,0)","v":4.4999999999999998E-2},"2.2 IPVA + Licenciamento + DPVAT",4.4999999999999998E-2,4.4999999999999998E-2,4.4999999999999998E-2,4.4999999999999998E-2,4.4999999999999998E-2,4.4999999999999998E-2,4.4999999999999998E-2,4.4999999999999998E-2,4.4999999999999998E-2,4.4999999999999998E-2,4.4999999999999998E-2]
[{"$f":"VLOOKUP(B10,$B:$M,CP_ID_MODELO+1,0)","v":1601.424},"2.3 Manutenção Preventiva e Corretiva",{"$f":"IF(C$25=12,C$30,IF(C$25=24,C$35,IF(C$25=36,C$40,0)))","v":1601.424},1601.424,2147.4719999999998,2147.4719999999998,2012.8319999999999,2012.8319999999999,2147.4719999999998,2147.4719999999998,3482.9279999999999,6679.0080000000007,6679.0080000000007]
[{"$f":"VLOOKUP(B11,$B:$M,CP_ID_MODELO+1,0)","v":1800},"2.4 Custo administrativo com a gestão da frota ",{"$f":"150*12","v":1800},{"$f":"150*12","v":1800},1800,1800,1800,1800,1800,1800,1800,1800,1800]
[{"$f":"VLOOKUP(B12,$B:$M,CP_ID_MODELO+1,0)","v":484.08000000000004},"2.5 Frota reserva (Locações eventuais)",484.08000000000004,532.68000000000006,576.48,619.79999999999995,562.79999999999995,771.19200000000001,648.48,885.48,1131.5999999999999,1378.68,1629.12]
[]
[{"$f":"VLOOKUP(B14,$B:$M,CP_ID_MODELO+1,0)","v":21380},"3.1 Valor Estimado para a venda do veículo",{"$f":"IF(C$25=12,C$32,IF(C$25=24,C$37,IF(C$25=36,C$42,0)))","v":21380},24230,25180,26130,20430,27550,23750,36100,53200,42750,38950]
[{"$f":"VLOOKUP(B15,$B:$M,CP_ID_MODELO+1,0)","v":350},"3.2 Custos do processo de venda",350,350,350,350,350,350,350,350,350,350,350]
[{"$f":"VLOOKUP(B16,$B:$M,CP_ID_MODELO+1,0)","v":710},"3.3 Manutenção para venda",710,780,850,910,830,1130,990,1360,1740,2110,2500]
[{"$f":"VLOOKUP(B17,$B:$M,CP_ID_MODELO+1,0)","v":350},"3.4 Frete desmobilização do veículo ",350,350,350,350,350,350,350,350,350,350,350]
[]
[{"$f":"VLOOKUP(B19,$B:$M,CP_ID_MODELO+1,0)","v":7.0000000000000007E-2},"4.1 Custo Oportunidade",7.0000000000000007E-2,7.0000000000000007E-2,7.0000000000000007E-2,7.0000000000000007E-2,7.0000000000000007E-2,7.0000000000000007E-2,7.0000000000000007E-2,7.0000000000000007E-2,7.0000000000000007E-2,7.0000000000000007E-2,7.0000000000000007E-2]
[0.2,"4.2 Depreciação Contábil (Base Receita Federal) "]
[{"$f":"VLOOKUP(B21,$B:$M,CP_ID_MODELO+1,0)","v":9.2499999999999999E-2},"4.3 PIS / Cofins - Anual",9.2499999999999999E-2,9.2499999999999999E-2,9.2499999999999999E-2,9.2499999999999999E-2,9.2499999999999999E-2,9.2499999999999999E-2,9.2499999999999999E-2,9.2499999999999999E-2,9.2499999999999999E-2,9.2499999999999999E-2,9.2499999999999999E-2]
[{"$f":"VLOOKUP(B22,$B:$M,CP_ID_MODELO+1,0)","v":0},"4.2 Contribuição Social"]
[{"$f":"VLOOKUP(B23,$B:$M,CP_ID_MODELO+1,0)","v":0.34},"4.5 Alíquota de Imposto de Renda + Constribuição Social",0.34,0.34,0.34,0.34,0.34,0.34,0.34,0.34,0.34,0.34,0.34]
[]
[{"$f":"VLOOKUP(B25,$B:$M,CP_ID_MODELO+1,0)","v":36},"Prazo do Contrato",{"$f":"N_CP_PRAZO_CONTRATO","v":36},36,36,36,36,36,36,36,36,36,36]
[{"$f":"VLOOKUP(B26,$B:$M,CP_ID_MODELO+1,0)","v":1100},"Valor do Aluguel",{"$f":"IF(C$25=12,C$31,IF(C$25=24,C$36,IF(C$25=36,C$41,0)))","v":1100},1160,1260,1350,1350,1870,1650,1980,2780,3930,4740]
[]
[]
[null,null,12,12,12,12,12,12,12,12,12,12,12]
[null,"Manutenção Preventiva e Corretiva",645.98400000000004,645.98400000000004,770.25600000000009,770.25600000000009,656.35199999999998,656.35199999999998,770.25600000000009,770.25600000000009,1110.528,5348.7359999999999,5348.7359999999999]
[null,"Valor do Aluguel",1230,1310,1500,1700,1880,2840,2360,2680,3930,5790,7690]
[null,"Valor Estimado para a venda do veículo",27550,30400,30400,31350,24230,32780,29450,44650,63650,57000,55100]
[]
[null,null,24,24,24,24,24,24,24,24,24,24,24]
[null,"Manutenção Preventiva e Corretiva",1589.04,1589.04,2164.752,2164.752,1903.3920000000003,1903.3920000000003,2164.752,2164.752,2316.5280000000002,6373.2960000000003,6373.2960000000003]
[null,"Valor do Aluguel",1210,1280,1370,1490,1500,2100,1840,2190,3100,4480,5490]
[null,"Valor Estimado para a venda do veículo",23280,26130,27550,28500,22330,30400,26600,39900,57950,47500,45600]
[]
[null,null,36,36,36,36,36,36,36,36,36,36,36]
[null,"Manutenção Preventiva e Corretiva",1601.424,1601.424,2147.4719999999998,2147.4719999999998,2012.8319999999999,2012.8319999999999,2147.4719999999998,2147.4719999999998,3482.9279999999999,6679.0080000000007,6679.0080000000007]
[null,"Valor do Aluguel",1100,1160,1260,1350,1350,1870,1650,1980,2780,3930,4740]
[null,"Valor Estimado para a venda do veículo",21380,24230,25180,26130,20430,27550,23750,36100,53200,42750,38950]
[]
[]
[null,"Modelo Referencia","Onix Joy 1.0 4P","Prisma Joy 1.0 4P","Onix LT MT 1.4 4P","Prisma LT MT 1.4 4P","Strada CS Working 1.4 2P","Strada CD Working 1.4 2P","Fiorino Evo 1.4 2P","Focus Hatch SE MT 1.6 4P","Corolla XEi AT 2.0 4P","S10 CS LS MT 4x4 2.8 2P","S10 CD LT MT 4x2 2.8 4P"]

{"sheet":"Textos_Ajuda","index":5,"n_rows":13,"n_cols":10,"rows_kept":13,"cut":false,"hidden":true,"merged":[]}
["Selecao","Item","Nome do Item","Texto Ajuda","Link","Link_Amigavel","Ano 1","Ano 2","Ano 3","Ano 4"]
[1,"2.1 Contratação de Seguro - Anual","Seguro Anual","Custo de apólices de seguro que protegem o carro, passageiros e terceiros. A média de Seguro pode chegar até 7% do valor do veículo, sem contar a Franquia. Porém, para o presente estudo estamos considerando 4%, visto que as Seguradoras concedem descontos para empresas. Conforme cálculo acima, o valor do seguro apresenta uma redução anual em função da desvalorização do veículo.","http://quatrorodas.abril.com.br/autoservico/seguros/mais.shtml","Veja o comparativo de Seguro da Quadro Rodas",{"$f":"'3.Fluxo_Caixa'!N11*-1","v":1419.9679999999998},{"$f":"'3.Fluxo_Caixa'!$Z$11*-1","v":1313.9786666666666},{"$f":"'3.Fluxo_Caixa'!AL11*-1","v":1207.9893333333334}]
[2,"2.2 IPVA + Licenciamento - Anual","IPVA + Licenciamento","Refere-se ao IPVA, que em São Paulo tem um custo de 4% do valor do veículo, mais a taxa anual de licenciamento (CRLV  e DPVAT), que gira em torno de 0,5% do valor do veículo. Conforme cálculo acima, o valor do IPVA + Licenciamento apresenta uma redução anual em função da desvalorização do veículo.","http://www.carrosnaweb.com.br/ipva.asp","Valor IPVA nos estados",{"$f":"'3.Fluxo_Caixa'!N12*-1","v":1597.4639999999997},{"$f":"'3.Fluxo_Caixa'!Z12*-1","v":1478.2259999999999},{"$f":"'3.Fluxo_Caixa'!AL12*-1","v":1358.9880000000001}]
[3,"2.3 Manutenção Preventiva e Corretiva - Mensal","Manutenção Preventiva e Corretiva","Na manutenção estão incluídas todas as despesas referentes à mão-de-obra, serviços e peças necessárias nas manutenções preventivas e corretivas por desgate natural do carro. Este item também inclui a troca pneus a cada 40.000km. As estimativas de custos apresentadas foram baseadas nas recomendações do fabricante.","-"," ",{"$f":"SUM('3.Fluxo_Caixa'!N13:Y13)*-1","v":645.98400000000004},{"$f":"SUM('3.Fluxo_Caixa'!Z13:AK13)*-1","v":645.98400000000004},{"$f":"SUM('3.Fluxo_Caixa'!AL13:AW13)*-1","v":645.98400000000004}]
[4,"2.4 Custo administrativo com a gestão da frota - Mensal","Custo administrativo gestão da frota","Despesas referentes a gestão da frota, como: o custo de mão-de-obra e estrutura física para a realização de controles de compra do carro, contratação de seguros e de recursos financeiros, processamento do pagamento de notas fiscais referentes a peças, manutenções, seguros, etc. ","-"," ",{"$f":"SUM('3.Fluxo_Caixa'!N14:Y14)*-1","v":1800},{"$f":"SUM('3.Fluxo_Caixa'!Z14:AK14)*-1","v":1800},{"$f":"SUM('3.Fluxo_Caixa'!AL14:AW14)*-1","v":1800}]
[5,"2.5 Frota reserva (Locações eventuais) [ % sobre o item 1.3 ] - Mensal","Frota reserva","Considera a locação de carro reserva para manter um veículo em prontidão nos casos de acidente, pane, manutenção, revisão, roubo, furto, etc., evitando-se, assim, que a empresa tenha prejuízos operacionais. No presente estudo, consideramos uma média de 4 diárias durante o ano.","-"," ",{"$f":"SUM('3.Fluxo_Caixa'!N15:Y15)*-1","v":484.08000000000015},{"$f":"SUM('3.Fluxo_Caixa'!Z15:AK15)*-1","v":484.08000000000015},{"$f":"SUM('3.Fluxo_Caixa'!AL15:AW15)*-1","v":484.08000000000015}]
[6,"3.1 Valor Estimado para a venda do veículo - Final Período","Valor estimado de venda","Valor que dará entrada no caixa, no ato da venda do carro, considerando a depreciação média do mercado. Deve-se levar em conta que geralmente as empresas vendem seus carros no Atacado, o que reduz o valor do automóvel.","-"," ",null,{"$f":"IF(N_CP_PRAZO_CONTRATO=12,N_CP_VALOR_ESTIMADO_VENDA_VEICULO,0)","v":0},{"$f":"IF(N_CP_PRAZO_CONTRATO=24,N_CP_VALOR_ESTIMADO_VENDA_VEICULO,0)","v":0},{"$f":"IF(N_CP_PRAZO_CONTRATO=36,N_CP_VALOR_ESTIMADO_VENDA_VEICULO,0)","v":27550}]
[7,"3.2 Custos do processo de venda - Final Período","Custos do processo de venda","Neste item entra despesas relacionadas a venda do veículo, como: aluguel de pátio, gastos com leilão, anúncio em sites etc.","-"," ",null,{"$f":"'3.Fluxo_Caixa'!Z16*-1","v":0},{"$f":"'3.Fluxo_Caixa'!AL16*-1","v":0},{"$f":"'3.Fluxo_Caixa'!AX16*-1","v":350}]
[8,"3.3 Manutenção para venda - Final Período","Manutenção para venda","Refere-se ao valor desembolsado para reparo/preparação do veículo após sua utilização, visando facilitar a venda pelo preço projetado. Caso não seja realizado esse reparo/preparação, deve-se considerar um desconto técnico para a venda.","-"," ",{"$f":"'3.Fluxo_Caixa'!Y17*-1","v":0},{"$f":"'3.Fluxo_Caixa'!AK17*-1","v":0},{"$f":"'3.Fluxo_Caixa'!AW17*-1","v":710}]
[9,"3.4 Frete desmobilização do veículo - Final Período","Frete para venda","Dependendo do canal de venda, será necessário custear o frete para a venda do veículo.","-"," ",null,{"$f":"'3.Fluxo_Caixa'!Y18*-1","v":0},{"$f":"'3.Fluxo_Caixa'!AK18*-1","v":0},{"$f":"'3.Fluxo_Caixa'!AW18*-1","v":350}]
[10,"4.1 Imposto de Renda + Contribuição Social - Anual","IR+CS","É a taxa média de imposto de renda (25%) e constribuição social (9%), aplicada sobre o total das despesas que a empresa recolhe mensalmente.","-"," "]
[11,"4.2 Custo Oportunidade [ % sobre o item 1.3 ] - Anual","Custo Oportunidade","No caso de compra a vista do automóvel, deve-se considerar o Custo de Oportunidade, que refere-se à taxa de juros que a empresa estaria remunerando seu capital se o mesmo não estivesse imobilizado em frota.  Para o Custo de Oportunidade, estamos considerando a taxa de juros dos Títulos Públicos. Se a empresa optar pelo financiamento, deve-se levar em conta os juros da operação.","http://www3.tesouro.gov.br/tesouro_direto/consulta_titulos_novosite/consultatitulos.asp"," Preços e taxas dos títulos públicos disponíveis para compra",{"$f":"'3.Fluxo_Caixa'!G22*-1","v":2408.6116552389281},{"$f":"'3.Fluxo_Caixa'!H22*-1","v":2408.6116552389281},{"$f":"'3.Fluxo_Caixa'!I22*-1","v":2408.6116552389281}]
[12,"Valor mensal do aluguel ","Valor mensal do aluguel ","Tarifa mensal da locação do veículo",null,null,{"$f":"N_CP_VALOR_ALUGUEL_MENSAL*12","v":14760},{"$f":"N_CP_VALOR_ALUGUEL_MENSAL*12","v":14760},{"$f":"N_CP_VALOR_ALUGUEL_MENSAL*12","v":14760}]

{"sheet":"aux","index":6,"n_rows":13,"n_cols":18,"rows_kept":13,"cut":false,"hidden":true,"merged":[]}
[]
[null,"Modelo",null,null,"Prazo",null,null,null,"Controles",null,null,"Campos Diversos",null,null,null,null,null,"Referencias"]
[]
[null,"#","Modelo",null,"#","Prazo",null,null,"ID Modelo",1,null,"ID Modelo",3,null,null,null,null,"http://exame.abril.com.br/seu-dinheiro/ferramentas/quanto-custa-manter-um-carro/"]
[null,1,{"$f":"IFERROR(HLOOKUP(TBL_MODELO[[#This Row],['#]],Dados!$1:$2,2,0),\"-\")","v":"Popular Hatch 1.0 Manual (Completo)"},null,1,"12 meses",null,null,"Valor Modelo",{"$f":"VLOOKUP(CP_ID_MODELO,TBL_MODELO[],2,0)","v":"Popular Hatch 1.0 Manual (Completo)"},null,"Valor Modelo",{"$f":"VLOOKUP(CP_ID_MODELO,TBL_MODELO[],2,0)","v":"Popular Hatch 1.0 Manual (Completo)"},null,null,null,null,"http://bestcars.uol.com.br/troca.htm"]
[null,2,{"$f":"IFERROR(HLOOKUP(TBL_MODELO[[#This Row],['#]],Dados!$1:$2,2,0),\"-\")","v":"Popular Sedan 1.0 Manual (Completo)"},null,2,"24 meses",null,null,null,null,null,"Campo gráfico",{"$f":"IF(OR(CP_NOME_EMPRESA=\"« Informe aqui o nome da Empresa »\",CP_NOME_EMPRESA=\"\"),\"Terceirizando a frota, sua empresa economiza:\",\"Terceirizando a frota, \"&CP_NOME_EMPRESA&\" economiza:\")","v":"Terceirizando a frota, sua empresa economiza:"},null,null,null,null,"http://classificados.folha.uol.com.br/veiculos/2013/09/1335217-gastos-com-carro-nos-3-primeiros-anos-de-uso-equivalem-ao-preco-de-outro-novo.shtml"]
[null,3,{"$f":"IFERROR(HLOOKUP(TBL_MODELO[[#This Row],['#]],Dados!$1:$2,2,0),\"-\")","v":"Popular Hatch 1.4 Manual (Completo)"},null,3,"36 meses",null,null,null,null,null,"Campo eixo",{"$f":"\"Valor Investido em \"&N_CP_PRAZO_CONTRATO&\" meses\"","v":"Valor Investido em 36 meses"},null,null,null,null,"http://www.sindilocpr.com.br/arquivos/Resumo_Estudo_Terceirizacao.pdf"]
[null,4,{"$f":"IFERROR(HLOOKUP(TBL_MODELO[[#This Row],['#]],Dados!$1:$2,2,0),\"-\")","v":"Popular Sedan 1.4 Manual (Completo)"},null,null,null,null,null,"ID Modelo",3,null,null,null,null,null,null,null,"http://www.receita.fazenda.gov.br/pessoajuridica/dipj/2005/pergresp2005/pr360a373.htm"]
[null,5,{"$f":"IFERROR(HLOOKUP(TBL_MODELO[[#This Row],['#]],Dados!$1:$2,2,0),\"-\")","v":"Pick-up Leve CS 1.4"},null,null,null,null,null,"Valor Prazo",{"$f":"LEFT(VLOOKUP(CP_ID_PRAZO,TBL_PRAZO[],2,0),2)*1","v":36}]
[null,6,{"$f":"IFERROR(HLOOKUP(TBL_MODELO[[#This Row],['#]],Dados!$1:$2,2,0),\"-\")","v":"Pick-up Leve CD 1.4"}]
[null,7,{"$f":"IFERROR(HLOOKUP(TBL_MODELO[[#This Row],['#]],Dados!$1:$2,2,0),\"-\")","v":"Utilitário Furgão 1.4 "},null,null,null,null,null,"Seleção Item",1]
[null,8,{"$f":"IFERROR(HLOOKUP(TBL_MODELO[[#This Row],['#]],Dados!$1:$2,2,0),\"-\")","v":"Executivo Hatch Manual 1.6"}]
[null,9,{"$f":"IFERROR(HLOOKUP(TBL_MODELO[[#This Row],['#]],Dados!$1:$2,2,0),\"-\")","v":"Executivo Sedan Automático 2.0"}]